BDBM50163106 (R)-3-Fluoromethyl-1,2,3,4-tetrahydro-isoquinoline-7-sulfonic acid (3-methoxy-propyl)-amide::CHEMBL174274
SMILES COCCCNS(=O)(=O)c1ccc2C[C@H](CF)NCc2c1
InChI Key InChIKey=DUVDGPSZMWUUNP-CYBMUJFWSA-N
Data  2 KI
  Tab Delimited (TSV)   2D SDfile   Computed 3D by Vconf -m prep SDfile
Find this compound or compounds like it in BindingDB:
Activity Spreadsheet -- Enzyme Inhibition Constant Data from BindingDB
Found 1 hit for monomerid = 50163106
TargetPhenylethanolamine N-methyltransferase(Homo sapiens (Human))
University Of Kansas
Curated by ChEMBL
LigandPNGBDBM50163106((R)-3-Fluoromethyl-1,2,3,4-tetrahydro-isoquinoline...)
Affinity DataKi:  1.20E+3nM. Assay description: In vitro binding affinity against recombinant human Phenylethanolamine N-methyltransferase expressed in E. coli using [methyl-3H]-AdoMet
In DepthDetails ArticlePubMed